{"text_format":"1","workbook":"xlsx","n_sheets":7,"sheets":["SOLICITAÇÃO","REPASSE ","MEMORIAL DESCRITIVO","Cor - Versões - Cód Barr","PLANO DE ENSAIO","Dados Solicitação","Dados"],"not_rendered":{"charts":0,"images":9,"macros":1,"external_links":1,"defined_names":21,"comments":0,"pivot_tables":0},"unopened":[],"bounds":{"document_bytes":16777216,"sheet_cells":100000,"rows_first":2000,"rows_last":500,"rows_between":2000,"halvings":0,"cell_chars":16384,"cell_head_chars":4096},"cells_cut":0,"cells_raw":0,"read":"whole","date_system":"1900"}

{"sheet":"SOLICITAÇÃO","index":0,"n_rows":53,"n_cols":4,"rows_kept":53,"cut":false,"hidden":false,"merged":[[27,2,27,4],[28,2,28,4],[29,2,29,4],[39,2,39,4],[38,3,38,4],[37,3,37,4],[36,3,36,4],[45,2,45,4],[44,3,44,4],[57,3,57,4],[54,3,54,4],[55,3,55,4],[56,3,56,4],[1,1,1,4],[6,1,6,4],[22,1,22,4],[41,1,41,4],[8,2,8,4],[17,2,17,4],[16,2,16,4],[15,2,15,4],[14,2,14,4],[13,2,13,4],[12,2,12,4],[11,2,11,4],[9,2,9,4],[19,2,19,4],[34,2,34,4],[35,2,35,4],[10,2,10,4],[58,3,58,4],[30,2,30,4],[31,2,31,4],[32,2,32,4],[50,1,50,4],[52,3,52,4],[53,3,53,4],[48,2,48,4],[33,2,33,4],[20,2,20,4],[18,2,18,4],[24,2,24,4],[25,2,25,4],[26,2,26,4],[46,2,46,4]]}
[]
[null,"                                \n                                 ANÁLISE DE VIABILIDADE - CARRINHO\n                 \n                               "]
[]
[null,"SOLICITAÇÃO:","-"]
[null,"MODELO DE CERTIFICAÇÃO:","-"]
[]
[null,"DADOS DA EMPRESA SOLICITANTE"]
[]
[null,"RAZÃO SOCIAL:","-"]
[null,"NOME FANTASIA:"]
[null,"CNPJ:","-"]
[null,"ENDEREÇO:","-"]
[null,"BAIRRO:","-"]
[null,"CEP:","-"]
[null,"CIDADE:","-"]
[null,"ESTADO:","-"]
[null,"E-MAIL:","-"]
[null,"NOME DO CONTATO:","-"]
[null,"TELEFONE: (   )","-"]
[null,"DATA DA SOLICITAÇÃO:","-"]
[null,null,"______________________________________________________________________\nAssinatura (obrigatório)"]
[]
[null,"DADOS DA FÁBRICA"]
[]
[null,"RAZÃO SOCIAL:","-"]
[null,"NOME FANTASIA:","-"]
[null,"CNPJ:","-"]
[null,"ENDEREÇO:","-"]
[null,"BAIRRO:","-"]
[null,"CEP:","-"]
[null,"CIDADE:","-"]
[null,"ESTADO:","-"]
[null,"PAÍS:","-"]
[null,"E-MAIL - FÁBRICA:","-"]
[null,"NOME DO CONTATO FÁBRICA:","-"]
[null,"TELEFONE (DDD) XXXXX-XXXX:","-"]
[null,"PROCEDÊNCIA: ","-"]
[null,{"$f":"IF(C37=\"IMPORTADO\",\"PAÍS DE ORIGEM:\",\"\")","v":""},"-"]
[null,"POSSUI CERTIFICAÇÃO ISO 9001? (vigente)","-",{"$f":"IF(C39=\"SIM\",\"Enviar certificado com validade vigente via e-mail\",\"\")","v":""}]
[null,{"$f":"IF(C39=\"sim\",\"DESCREVA O ESCOPO DE CERTIFICAÇÃO\",\"\")","v":""},"-"]
{"$rows_left_out":14}
{"sheet":"REPASSE ","index":1,"n_rows":29,"n_cols":3,"rows_kept":29,"cut":false,"hidden":true,"merged":[[28,1,32,1],[16,2,16,4],[18,2,18,4],[20,2,20,4],[28,2,32,4],[8,2,8,4],[9,2,9,4],[10,2,10,4],[22,2,22,4],[1,1,1,4],[3,1,3,4],[5,2,5,4],[6,2,6,4],[7,2,7,4],[11,2,11,4],[12,2,12,4],[13,2,13,4],[14,2,14,4],[15,2,15,4]]}
[]
[null,"REPASSE"]
[]
[null,"DADOS DO EMBALADOR - (Somente em caso de repasse)"]
[]
[null,"RAZÃO SOCIAL:","-"]
[null,"NOME FANTASIA:","-"]
[null,"CNPJ:","-"]
[null,"ENDEREÇO:","-"]
[null,"BAIRRO:","-"]
[null,"CEP:","-"]
[null,"CIDADE:","-"]
[null,"ESTADO:","-"]
[null,"E-MAIL:","-"]
[null,"NOME DO CONTATO:","-"]
[null,"TELEFONE: (   )","-"]
[null,"DATA DA SOLICITAÇÃO:","-"]
[]
[null,"N° AUTORIZAÇÃO PARTICULAR DE REPASSE:","-"]
[]
[null,"N° AUTORIZAÇÃO DE USO DA MARCA:","-"]
[]
[null,"N° DE LICENÇA DE IMPORTAÇÃO:","-"]
[]
[null,"PROCEDÊNCIA: ","-"]
[null,{"$f":"IF(C25=\"IMPORTADO\",\"PAÍS DE ORIGEM:\",\"\")","v":""},"-"]
[null,{"$f":"IF(C25=\"IMPORTADO\",\"N° DA LICENÇA DE IMPORTAÇÃO\",\"-\")","v":"-"},"-"]
[]
[null,null,"______________________________________________________________________\nAssinatura (obrigatório)\n"]

{"sheet":"MEMORIAL DESCRITIVO","index":2,"n_rows":116,"n_cols":17,"rows_kept":116,"cut":false,"hidden":false,"merged":[[8,4,8,5],[8,7,8,8],[8,10,8,11],[8,13,8,14],[9,1,9,2],[9,4,9,5],[9,7,9,8],[9,10,9,11],[9,13,9,14],[1,1,1,14],[11,1,11,14],[42,1,42,14],[113,1,113,14],[115,1,124,1],[115,2,124,2],[115,4,124,4],[115,5,124,8],[115,10,124,10],[57,1,57,2],[56,1,56,2],[55,1,55,2],[50,1,53,2],[6,1,6,2],[5,1,5,2],[100,1,100,14],[87,1,87,14],[76,1,76,14],[102,1,111,1],[102,4,111,4],[102,10,111,10],[63,1,63,2],[115,11,124,14],[8,1,8,2],[102,5,111,8],[102,2,111,2],[89,1,98,1],[89,7,98,7],[89,2,98,5],[89,8,98,11],[59,1,59,2],[58,1,58,2],[64,1,64,2],[102,11,111,14],[89,13,98,14],[81,5,82,7],[81,8,82,8],[81,9,82,11],[56,10,62,14],[63,10,63,14],[84,1,85,4],[84,5,85,7],[84,8,85,11],[83,1,83,11],[72,1,74,11],[71,1,71,11],[77,1,78,4],[77,5,78,7],[13,13,14,13],[16,13,17,13],[19,13,20,13],[22,13,23,13],[6,4,6,8],[44,1,48,1],[3,4,3,8],[4,4,4,8],[5,4,5,8],[4,1,4,2],[3,1,3,2],[13,10,14,10],[16,10,17,10],[19,10,20,10],[22,10,23,10],[25,10,26,10],[19,1,20,1],[16,1,17,1],[13,1,14,1],[13,4,14,4],[28,1,29,1],[28,4,29,4],[28,7,29,7],[28,10,29,10],[16,4,17,4],[19,4,20,4],[22,4,23,4],[25,4,26,4],[13,7,14,7],[16,7,17,7],[19,7,20,7],[22,7,23,7],[25,7,26,7],[25,1,26,1],[22,1,23,1],[34,1,35,1],[34,4,35,4],[34,7,35,7],[34,10,35,10],[34,13,35,13],[37,1,38,1],[37,4,38,4],[37,7,38,7],[37,10,38,10],[37,13,38,13],[25,13,26,13],[60,1,60,2],[70,13,74,14],[70,1,70,11],[68,1,68,2],[67,3,67,4],[68,3,68,4],[28,13,29,13],[31,1,32,1],[31,4,32,4],[31,7,32,7],[31,10,32,10],[31,13,32,13],[44,7,48,14],[55,7,55,8],[55,10,55,11],[50,12,53,14],[50,9,53,11],[50,7,53,8],[66,1,66,5],[67,1,67,2],[66,10,68,14],[77,9,78,11],[77,8,78,8],[79,5,80,7],[79,8,80,8],[79,9,80,11],[79,1,80,4],[81,1,82,4],[77,16,82,17],[62,1,62,2],[77,12,85,14]]}
[]
[null,"IDENTIFICAÇÃO DO MODELO OBJETO DA CERTIFICAÇÃO"]
[]
[null,"MODELO:",null,null,"-"]
[null,"MARCA:",null,null,"-"]
[null,"NOME COMERCIAL:",null,null,"-"]
[null,"CÓDIGO DO FABRICANTE:",null,null,"-"]
[]
[null,{"$f":"IF(SOLICITAÇÃO!C5=\"MODELO 1b - LOTE\",\"IDENTIFICAÇÃO LOTE\",\"\")","v":""},null,null,{"$f":"IF(SOLICITAÇÃO!C5=\"MODELO 1b - LOTE\",\"QUANTIDADE DO LOTE\",\"\")","v":""},null,null,{"$f":"IF(SOLICITAÇÃO!C5=\"MODELO 1b - LOTE\",\"N° DO LOTE DE FABRICAÇÃO\",\"\")","v":""},null,null,{"$f":"IF(SOLICITAÇÃO!C5=\"MODELO 1b - LOTE\",\"LI/LPCO/DI/DUIMP\",\"\")","v":""},null,null,{"$f":"IF(SOLICITAÇÃO!C5=\"MODELO 1b - LOTE\",\"N° DO EDITAL\",\"\")","v":""}]
[]
[]
[null,"VERSÃO/COR/ESTAMPA - CÓDIGO DE BARRAS"]
[]
[null,1,{"$f":"IFERROR(VLOOKUP(B14,'Cor - Versões - Cód Barr'!$B$3:$D$30,2,0),\" \")","v":"-"},null,10,{"$f":"IFERROR(VLOOKUP(E14,'Cor - Versões - Cód Barr'!$B$3:$D$47,2,0),\" \")","v":"-"},null,19,{"$f":"IFERROR(VLOOKUP(H14,'Cor - Versões - Cód Barr'!$B$3:$D$47,2,0),\" \")","v":"-"},null,28,{"$f":"IFERROR(VLOOKUP(K14,'Cor - Versões - Cód Barr'!$B$3:$D$47,2,0),\" \")","v":"-"},null,37,{"$f":"IFERROR(VLOOKUP(N14,'Cor - Versões - Cód Barr'!$B$3:$D$47,2,0),\" \")","v":"-"}]
[null,null,{"$f":"IFERROR(VLOOKUP(B14,'Cor - Versões - Cód Barr'!$B$3:$D$30,3,0),\" \")","v":"-"},null,null,{"$f":"IFERROR(VLOOKUP(E14,'Cor - Versões - Cód Barr'!$B$3:$D$47,3,0),\" \")","v":"-"},null,null,{"$f":"IFERROR(VLOOKUP(H14,'Cor - Versões - Cód Barr'!$B$3:$D$47,3,0),\" \")","v":"-"},null,null,{"$f":"IFERROR(VLOOKUP(K14,'Cor - Versões - Cód Barr'!$B$3:$D$47,3,0),\" \")","v":"-"},null,null,{"$f":"IFERROR(VLOOKUP(N14,'Cor - Versões - Cód Barr'!$B$3:$D$47,3,0),\" \")","v":"-"}]
[]
[null,2,{"$f":"IFERROR(VLOOKUP(B17,'Cor - Versões - Cód Barr'!$B$3:$D$30,2,0),\" \")","v":"-"},null,11,{"$f":"IFERROR(VLOOKUP(E17,'Cor - Versões - Cód Barr'!$B$3:$D$47,2,0),\" \")","v":"-"},null,20,{"$f":"IFERROR(VLOOKUP(H17,'Cor - Versões - Cód Barr'!$B$3:$D$47,2,0),\" \")","v":"-"},null,29,{"$f":"IFERROR(VLOOKUP(K17,'Cor - Versões - Cód Barr'!$B$3:$D$47,2,0),\" \")","v":"-"},null,38,{"$f":"IFERROR(VLOOKUP(N17,'Cor - Versões - Cód Barr'!$B$3:$D$47,2,0),\" \")","v":"-"}]
[null,null,{"$f":"IFERROR(VLOOKUP(B17,'Cor - Versões - Cód Barr'!$B$3:$D$30,3,0),\" \")","v":"-"},null,null,{"$f":"IFERROR(VLOOKUP(E17,'Cor - Versões - Cód Barr'!$B$3:$D$47,3,0),\" \")","v":"-"},null,null,{"$f":"IFERROR(VLOOKUP(H17,'Cor - Versões - Cód Barr'!$B$3:$D$47,3,0),\" \")","v":"-"},null,null,{"$f":"IFERROR(VLOOKUP(K17,'Cor - Versões - Cód Barr'!$B$3:$D$47,3,0),\" \")","v":"-"},null,null,{"$f":"IFERROR(VLOOKUP(N17,'Cor - Versões - Cód Barr'!$B$3:$D$47,3,0),\" \")","v":"-"}]
[]
[null,3,{"$f":"IFERROR(VLOOKUP(B20,'Cor - Versões - Cód Barr'!$B$3:$D$30,2,0),\" \")","v":"-"},null,12,{"$f":"IFERROR(VLOOKUP(E20,'Cor - Versões - Cód Barr'!$B$3:$D$47,2,0),\" \")","v":"-"},null,21,{"$f":"IFERROR(VLOOKUP(H20,'Cor - Versões - Cód Barr'!$B$3:$D$47,2,0),\" \")","v":"-"},null,30,{"$f":"IFERROR(VLOOKUP(K20,'Cor - Versões - Cód Barr'!$B$3:$D$47,2,0),\" \")","v":"-"},null,39,{"$f":"IFERROR(VLOOKUP(N20,'Cor - Versões - Cód Barr'!$B$3:$D$47,2,0),\" \")","v":"-"}]
[null,null,{"$f":"IFERROR(VLOOKUP(B20,'Cor - Versões - Cód Barr'!$B$3:$D$30,3,0),\" \")","v":"-"},null,null,{"$f":"IFERROR(VLOOKUP(E20,'Cor - Versões - Cód Barr'!$B$3:$D$47,3,0),\" \")","v":"-"},null,null,{"$f":"IFERROR(VLOOKUP(H20,'Cor - Versões - Cód Barr'!$B$3:$D$47,3,0),\" \")","v":"-"},null,null,{"$f":"IFERROR(VLOOKUP(K20,'Cor - Versões - Cód Barr'!$B$3:$D$47,3,0),\" \")","v":"-"},null,null,{"$f":"IFERROR(VLOOKUP(N20,'Cor - Versões - Cód Barr'!$B$3:$D$47,3,0),\" \")","v":"-"}]
[]
[null,4,{"$f":"IFERROR(VLOOKUP(B23,'Cor - Versões - Cód Barr'!$B$3:$D$30,2,0),\" \")","v":"-"},null,13,{"$f":"IFERROR(VLOOKUP(E23,'Cor - Versões - Cód Barr'!$B$3:$D$47,2,0),\" \")","v":"-"},null,22,{"$f":"IFERROR(VLOOKUP(H23,'Cor - Versões - Cód Barr'!$B$3:$D$47,2,0),\" \")","v":"-"},null,31,{"$f":"IFERROR(VLOOKUP(K23,'Cor - Versões - Cód Barr'!$B$3:$D$47,2,0),\" \")","v":"-"},null,40,{"$f":"IFERROR(VLOOKUP(N23,'Cor - Versões - Cód Barr'!$B$3:$D$47,2,0),\" \")","v":"-"}]
[null,null,{"$f":"IFERROR(VLOOKUP(B23,'Cor - Versões - Cód Barr'!$B$3:$D$30,3,0),\" \")","v":"-"},null,null,{"$f":"IFERROR(VLOOKUP(E23,'Cor - Versões - Cód Barr'!$B$3:$D$47,3,0),\" \")","v":"-"},null,null,{"$f":"IFERROR(VLOOKUP(H23,'Cor - Versões - Cód Barr'!$B$3:$D$47,3,0),\" \")","v":"-"},null,null,{"$f":"IFERROR(VLOOKUP(K23,'Cor - Versões - Cód Barr'!$B$3:$D$47,3,0),\" \")","v":"-"},null,null,{"$f":"IFERROR(VLOOKUP(N23,'Cor - Versões - Cód Barr'!$B$3:$D$47,3,0),\" \")","v":"-"}]
[]
[null,5,{"$f":"IFERROR(VLOOKUP(B26,'Cor - Versões - Cód Barr'!$B$3:$D$30,2,0),\" \")","v":"-"},null,14,{"$f":"IFERROR(VLOOKUP(E26,'Cor - Versões - Cód Barr'!$B$3:$D$47,2,0),\" \")","v":"-"},null,23,{"$f":"IFERROR(VLOOKUP(H26,'Cor - Versões - Cód Barr'!$B$3:$D$47,2,0),\" \")","v":"-"},null,32,{"$f":"IFERROR(VLOOKUP(K26,'Cor - Versões - Cód Barr'!$B$3:$D$47,2,0),\" \")","v":"-"},null,41,{"$f":"IFERROR(VLOOKUP(N26,'Cor - Versões - Cód Barr'!$B$3:$D$47,2,0),\" \")","v":"-"}]
[null,null,{"$f":"IFERROR(VLOOKUP(B26,'Cor - Versões - Cód Barr'!$B$3:$D$30,3,0),\" \")","v":"-"},null,null,{"$f":"IFERROR(VLOOKUP(E26,'Cor - Versões - Cód Barr'!$B$3:$D$47,3,0),\" \")","v":"-"},null,null,{"$f":"IFERROR(VLOOKUP(H26,'Cor - Versões - Cód Barr'!$B$3:$D$47,3,0),\" \")","v":"-"},null,null,{"$f":"IFERROR(VLOOKUP(K26,'Cor - Versões - Cód Barr'!$B$3:$D$47,3,0),\" \")","v":"-"},null,null,{"$f":"IFERROR(VLOOKUP(N26,'Cor - Versões - Cód Barr'!$B$3:$D$47,3,0),\" \")","v":"-"}]
[]
[null,6,{"$f":"IFERROR(VLOOKUP(B29,'Cor - Versões - Cód Barr'!$B$3:$D$30,2,0),\" \")","v":"-"},null,15,{"$f":"IFERROR(VLOOKUP(E29,'Cor - Versões - Cód Barr'!$B$3:$D$47,2,0),\" \")","v":"-"},null,24,{"$f":"IFERROR(VLOOKUP(H29,'Cor - Versões - Cód Barr'!$B$3:$D$47,2,0),\" \")","v":"-"},null,33,{"$f":"IFERROR(VLOOKUP(K29,'Cor - Versões - Cód Barr'!$B$3:$D$47,2,0),\" \")","v":"-"},null,42,{"$f":"IFERROR(VLOOKUP(N29,'Cor - Versões - Cód Barr'!$B$3:$D$47,2,0),\" \")","v":"-"}]
[null,null,{"$f":"IFERROR(VLOOKUP(B29,'Cor - Versões - Cód Barr'!$B$3:$D$30,3,0),\" \")","v":"-"},null,null,{"$f":"IFERROR(VLOOKUP(E29,'Cor - Versões - Cód Barr'!$B$3:$D$47,3,0),\" \")","v":"-"},null,null,{"$f":"IFERROR(VLOOKUP(H29,'Cor - Versões - Cód Barr'!$B$3:$D$47,3,0),\" \")","v":"-"},null,null,{"$f":"IFERROR(VLOOKUP(K29,'Cor - Versões - Cód Barr'!$B$3:$D$47,3,0),\" \")","v":"-"},null,null,{"$f":"IFERROR(VLOOKUP(N29,'Cor - Versões - Cód Barr'!$B$3:$D$47,3,0),\" \")","v":"-"}]
[]
[null,7,{"$f":"IFERROR(VLOOKUP(B32,'Cor - Versões - Cód Barr'!$B$3:$D$30,2,0),\" \")","v":"-"},null,16,{"$f":"IFERROR(VLOOKUP(E32,'Cor - Versões - Cód Barr'!$B$3:$D$47,2,0),\" \")","v":"-"},null,25,{"$f":"IFERROR(VLOOKUP(H32,'Cor - Versões - Cód Barr'!$B$3:$D$47,2,0),\" \")","v":"-"},null,34,{"$f":"IFERROR(VLOOKUP(K32,'Cor - Versões - Cód Barr'!$B$3:$D$47,2,0),\" \")","v":"-"},null,43,{"$f":"IFERROR(VLOOKUP(N32,'Cor - Versões - Cód Barr'!$B$3:$D$47,2,0),\" \")","v":"-"}]
[null,null,{"$f":"IFERROR(VLOOKUP(B32,'Cor - Versões - Cód Barr'!$B$3:$D$30,3,0),\" \")","v":"-"},null,null,{"$f":"IFERROR(VLOOKUP(E32,'Cor - Versões - Cód Barr'!$B$3:$D$47,3,0),\" \")","v":"-"},null,null,{"$f":"IFERROR(VLOOKUP(H32,'Cor - Versões - Cód Barr'!$B$3:$D$47,3,0),\" \")","v":"-"},null,null,{"$f":"IFERROR(VLOOKUP(K32,'Cor - Versões - Cód Barr'!$B$3:$D$47,3,0),\" \")","v":"-"},null,null,{"$f":"IFERROR(VLOOKUP(N32,'Cor - Versões - Cód Barr'!$B$3:$D$47,3,0),\" \")","v":"-"}]
[]
[null,8,{"$f":"IFERROR(VLOOKUP(B35,'Cor - Versões - Cód Barr'!$B$3:$D$30,2,0),\" \")","v":"-"},null,17,{"$f":"IFERROR(VLOOKUP(E35,'Cor - Versões - Cód Barr'!$B$3:$D$47,2,0),\" \")","v":"-"},null,26,{"$f":"IFERROR(VLOOKUP(H35,'Cor - Versões - Cód Barr'!$B$3:$D$47,2,0),\" \")","v":"-"},null,35,{"$f":"IFERROR(VLOOKUP(K35,'Cor - Versões - Cód Barr'!$B$3:$D$47,2,0),\" \")","v":"-"},null,44,{"$f":"IFERROR(VLOOKUP(N35,'Cor - Versões - Cód Barr'!$B$3:$D$47,2,0),\" \")","v":"-"}]
[null,null,{"$f":"IFERROR(VLOOKUP(B35,'Cor - Versões - Cód Barr'!$B$3:$D$30,3,0),\" \")","v":"-"},null,null,{"$f":"IFERROR(VLOOKUP(E35,'Cor - Versões - Cód Barr'!$B$3:$D$47,3,0),\" \")","v":"-"},null,null,{"$f":"IFERROR(VLOOKUP(H35,'Cor - Versões - Cód Barr'!$B$3:$D$47,3,0),\" \")","v":"-"},null,null,{"$f":"IFERROR(VLOOKUP(K35,'Cor - Versões - Cód Barr'!$B$3:$D$47,3,0),\" \")","v":"-"},null,null,{"$f":"IFERROR(VLOOKUP(N35,'Cor - Versões - Cód Barr'!$B$3:$D$47,3,0),\" \")","v":"-"}]
[]
[null,9,{"$f":"IFERROR(VLOOKUP(B38,'Cor - Versões - Cód Barr'!$B$3:$D$30,2,0),\" \")","v":"-"},null,18,{"$f":"IFERROR(VLOOKUP(E38,'Cor - Versões - Cód Barr'!$B$3:$D$47,2,0),\" \")","v":"-"},null,27,{"$f":"IFERROR(VLOOKUP(H38,'Cor - Versões - Cód Barr'!$B$3:$D$47,2,0),\" \")","v":"-"},null,36,{"$f":"IFERROR(VLOOKUP(K38,'Cor - Versões - Cód Barr'!$B$3:$D$47,2,0),\" \")","v":"-"},null,45,{"$f":"IFERROR(VLOOKUP(N38,'Cor - Versões - Cód Barr'!$B$3:$D$47,2,0),\" \")","v":"-"}]
[null,null,{"$f":"IFERROR(VLOOKUP(B38,'Cor - Versões - Cód Barr'!$B$3:$D$30,3,0),\" \")","v":"-"},null,null,{"$f":"IFERROR(VLOOKUP(E38,'Cor - Versões - Cód Barr'!$B$3:$D$47,3,0),\" \")","v":"-"},null,null,{"$f":"IFERROR(VLOOKUP(H38,'Cor - Versões - Cód Barr'!$B$3:$D$47,3,0),\" \")","v":"-"},null,null,{"$f":"IFERROR(VLOOKUP(K38,'Cor - Versões - Cód Barr'!$B$3:$D$47,3,0),\" \")","v":"-"},null,null,{"$f":"IFERROR(VLOOKUP(N38,'Cor - Versões - Cód Barr'!$B$3:$D$47,3,0),\" \")","v":"-"}]
[]
{"$rows_left_out":77}
{"sheet":"Cor - Versões - Cód Barr","index":3,"n_rows":47,"n_cols":4,"rows_kept":47,"cut":false,"hidden":false,"merged":[]}
[]
[null,null,"COR/VERSÕES"," CÓDIGO DE BARRAS"]
[null,1,"-","-"]
[null,2,"-","-"]
[null,3,"-","-"]
[null,4,"-","-"]
[null,5,"-","-"]
[null,6,"-","-"]
[null,7,"-","-"]
[null,8,"-","-"]
[null,9,"-","-"]
[null,10,"-","-"]
[null,11,"-","-"]
[null,12,"-","-"]
[null,13,"-","-"]
[null,14,"-","-"]
[null,15,"-","-"]
[null,16,"-","-"]
[null,17,"-","-"]
[null,18,"-","-"]
[null,19,"-","-"]
[null,20,"-","-"]
[null,21,"-","-"]
[null,22,"-","-"]
[null,23,"-","-"]
[null,24,"-","-"]
[null,25,"-","-"]
[null,26,"-","-"]
[null,27,"-","-"]
[null,28,"-","-"]
[null,29,"-","-"]
[null,30,"-","-"]
[null,31,"-","-"]
[null,32,"-","-"]
[null,33,"-","-"]
[null,34,"-","-"]
[null,35,"-","-"]
[null,36,"-","-"]
[null,37,"-","-"]
[null,38,"-","-"]
{"$rows_left_out":8}
{"sheet":"PLANO DE ENSAIO","index":4,"n_rows":73,"n_cols":8,"rows_kept":73,"cut":false,"hidden":true,"merged":[[27,1,27,9],[28,5,28,9],[65,7,65,9],[66,7,66,9],[67,7,67,9],[68,7,68,9],[69,7,69,9],[70,7,70,9],[56,7,56,9],[57,7,57,9],[58,7,58,9],[59,7,59,9],[60,7,60,9],[61,7,61,9],[50,7,50,9],[51,7,51,9],[52,7,52,9],[53,7,53,9],[54,7,54,9],[55,7,55,9],[42,7,42,9],[52,2,52,4],[32,2,32,4],[70,2,70,4],[72,2,72,4],[71,2,71,4],[30,7,30,9],[31,7,31,9],[32,7,32,9],[33,7,33,9],[34,7,34,9],[35,7,35,9],[36,7,36,9],[58,2,58,4],[57,2,57,4],[56,2,56,4],[55,2,55,4],[54,2,54,4],[53,2,53,4],[64,2,64,4],[63,2,63,4],[62,2,62,4],[71,7,71,9],[72,7,72,9],[61,2,61,4],[60,2,60,4],[59,2,59,4],[33,2,33,4],[69,2,69,4],[68,2,68,4],[67,2,67,4],[66,2,66,4],[65,2,65,4],[39,2,39,4],[38,2,38,4],[37,2,37,4],[45,2,45,4],[44,2,44,4],[43,2,43,4],[42,2,42,4],[41,2,41,4],[40,2,40,4],[51,2,51,4],[50,2,50,4],[49,2,49,4],[48,2,48,4],[47,2,47,4],[46,2,46,4],[18,1,26,2],[18,3,26,4],[26,6,26,9],[23,6,23,9],[24,5,24,9],[18,6,18,9],[19,6,19,9],[20,6,20,9],[21,6,21,9],[22,6,22,9],[25,6,25,9],[31,2,31,4],[30,2,30,4],[36,2,36,4],[35,2,35,4],[34,2,34,4],[28,1,28,4],[62,7,62,9],[63,7,63,9],[64,7,64,9],[37,7,37,9],[38,7,38,9],[39,7,39,9],[40,7,40,9],[41,7,41,9],[48,7,48,9],[49,7,49,9],[43,7,43,9],[44,7,44,9],[45,7,45,9],[46,7,46,9],[47,7,47,9],[29,1,29,9],[15,3,15,4],[17,1,17,2],[16,3,16,4],[15,6,15,9],[8,1,8,2],[8,3,8,9],[12,1,12,2],[7,1,7,2],[17,3,17,4],[12,6,12,9],[13,1,13,9],[15,1,15,2],[16,1,16,2],[10,1,10,2],[9,1,9,2],[10,3,10,4],[12,3,12,4],[10,6,10,9],[14,1,14,4],[14,5,14,9],[17,6,17,9],[16,6,16,9],[9,3,9,4],[1,1,2,5],[1,6,1,9],[3,1,3,9],[4,1,4,2],[11,1,11,2],[11,3,11,4],[11,6,11,9],[5,1,5,2],[5,3,5,5],[4,3,4,9],[7,3,7,9],[6,1,6,2],[6,3,6,9],[2,7,2,9],[5,7,5,9],[9,6,9,9]]}
[]
[null,"PLANO DE ENSAIOS PARA CARRINHOS",null,null,null,null,"FOR.2.2"]
[null,null,null,null,null,null,"REV.02","2025-07-14"]
[null,"IDENTIFICAÇÃO DO SOLICITANTE"]
[null,"Razão Social: (Solicitante)",null,{"$f":"SOLICITAÇÃO!C9","v":"-"}]
[null,"Endereço: (Solicitante)",null,{"$f":"CONCATENATE(SOLICITAÇÃO!C12,\" - \",SOLICITAÇÃO!C13,\" - \",SOLICITAÇÃO!C15,\" - \",SOLICITAÇÃO!C16)","v":"- - - - - - -"},null,null,"CEP:",{"$f":"SOLICITAÇÃO!C14","v":"-"}]
[null,"CNPJ: (Solicitante)",null,{"$f":"SOLICITAÇÃO!C11","v":"-"}]
[null,"Fabricante:",null,{"$f":"SOLICITAÇÃO!C25","v":"-"}]
[null,"Portaria:",null,"PORTARIA Nº 167, DE 13 DE ABRIL DE 2021 - Aprova o Regulamento Técnico da Qualidade e os Requisitos de Avaliação da Conformidade para Carrinhos para Crianças – Consolidado;\nPORTARIA Nº 11, DE 2 DE JANEIRO DE 2025 - Altera a Portaria Inmetro nº 167, de 13 de abril de 2021, que aprova o Regulamento Técnico da Qualidade e os Requisitos de Avaliação da Conformidade para Carrinhos para Crianças - Consolidado."]
[null,"Rastreabilidade da amostra:",null,null,null,"Quantidade de amostras:"]
[null,"Modelo de certificação:",null,{"$f":"SOLICITAÇÃO!C5","v":"-"},null,"Tipo de amostra:","ESCOLHER UM ITEM."]
[null,"Tipo Amostragem:",null,"Escolher um item.",null,"Processo: (Evento)"]
[null,"Técnico responsável:",null,null,null,"Data:"]
[null,"IDENTIFICAÇÃO DA AMOSTRA"]
[null,"Identificação do modelo ",null,null,null,"Características construtivas"]
[null,"Modelo:",null,{"$f":"'MEMORIAL DESCRITIVO'!E4","v":"-"},null,"Material: \n(chassi/unidade de assento/sistema de retenção)",{"$f":"CONCATENATE('MEMORIAL DESCRITIVO'!F45,\" / \",'MEMORIAL DESCRITIVO'!F47,\" / \",'MEMORIAL DESCRITIVO'!F48,\" / \",)","v":"- / - / - / "}]
[null,"Marca:",null,{"$f":"'MEMORIAL DESCRITIVO'!E5","v":"-"},null,"Dimensões:",{"$f":"'MEMORIAL DESCRITIVO'!F57","v":"-"}]
[null,"Nome comercial:",null,{"$f":"'MEMORIAL DESCRITIVO'!E6","v":"-"},null,"Tipo de Carrinho: (primário/secundário)",{"$f":"CONCATENATE('MEMORIAL DESCRITIVO'!F56,\" / \",'MEMORIAL DESCRITIVO'!K56)","v":"- / -"}]
[null,"Foto do produto:",null,null,null,"Idade mínima:",{"$f":"'MEMORIAL DESCRITIVO'!F58","v":"-"}]
[null,null,null,null,null,"Idade máxima:",{"$f":"'MEMORIAL DESCRITIVO'!F59","v":"-"}]
[null,null,null,null,null,"Mecanismo de travamento:",{"$f":"'MEMORIAL DESCRITIVO'!F60","v":"-"}]
[null,null,null,null,null,"Sistema de montagem/ferragem:",{"$f":"'MEMORIAL DESCRITIVO'!F61","v":"-"}]
[null,null,null,null,null,"Número máximo de crianças que podem ser transportadas:",{"$f":"'MEMORIAL DESCRITIVO'!F65","v":"-"}]
[null,null,null,null,null,"Acessórios:",{"$f":"'MEMORIAL DESCRITIVO'!B73","v":0}]
[null,null,null,null,null,"Peso a que se destina:"]
[null,null,null,null,null,"Carrinho até 15 kg?",{"$f":"'MEMORIAL DESCRITIVO'!F68","v":"-"}]
[null,null,null,null,null,"Carrinho de 15 kg a 22 kg?",{"$f":"'MEMORIAL DESCRITIVO'!F69","v":"-"}]
[null,"METODOLOGIA:"]
[null,"Base normativa a ser utilizada",null,null,null,"ABNT NBR 14389-1 e ABNT NBR 14389-2 /\n PORTARIA Nº 167, DE 13 DE ABRIL DE 2021 e PORTARIA Nº 11, DE 2 DE JANEIRO DE 2025"]
[null,"Tabela 1: Ensaios e itens de verificação a serem realizados em carrinhos para crianças"]
[null,"Requisito do RTQ","Ensaios",null,null,"Base Normativa e \nCritérios de Aceitação","Item","Execução?"]
[null,"2.1","Propriedades químicas",null,null,"ABNT NBR 14389 - 1",6,"Escolher um item."]
[null,"2.2","Inflamabilidade",null,null,"ABNT NBR 14389 - 1",7,"Escolher um item."]
[null,"2.4","Pontos de cisalhamento e compressão",null,null,"ABNT NBR 14389 - 1","8.3.2 e 8.3.3","Escolher um item."]
[null,"2.5","Riscos de aprisionamento",null,null,"ABNT NBR 14389 - 1","8.2","Escolher um item."]
[null,"2.6","Bordas e saliências perigosas",null,null,"ABNT NBR 14389 - 1","8.7","Escolher um item."]
[null,"2.7, 2.8","Riscos de engasgamento e ingestão",null,null,"ABNT NBR 14389 - 1","8.5","Escolher um item."]
[null,"2.10","Riscos de estrangulamento",null,null,"ABNT NBR 14389 - 1","8.4.1","Escolher um item."]
[null,"2.11","Revestimento interno do cesto para bebês ou unidade de assento",null,null,"ABNT NBR 14389 - 1","8.6.1","Escolher um item."]
[null,"2.12","Ensaio de retenção da esfera",null,null,"ABNT NBR 14389 - 1","8.1.1.2.2","Escolher um item."]
{"$rows_left_out":34}
{"sheet":"Dados Solicitação","index":5,"n_rows":7,"n_cols":5,"rows_kept":7,"cut":false,"hidden":true,"merged":[]}
[null,"-","-","-","-"]
["-","NACIONAL","INICIAL","MODELO 5","BERÇO"]
["SIM","IMPORTADO","MANUTENÇÃO","MODELO 1b - LOTE","ANDADOR"]
["NÃO",null,"INCLUSÃO / REVISÃO",null,"MÓBILE"]
["N° DA LICENÇA P/ USO DE MARCAS:",null,"RECERTIFICAÇÃO",null,"JUMPER"]
[null,null,"TRANSFERÊNCIA",null,"BOUNCER"]
[null,null,null,null,"OUTROS"]

{"sheet":"Dados","index":6,"n_rows":26,"n_cols":15,"rows_kept":26,"cut":false,"hidden":true,"merged":[]}
["-",null,null,null,null,null,null,"-",null,"-"]
["Carrinho Tipo Berço",null,"-","-",null,"-","-","Não possui",null,"Liberação em duas ações consecutivas",null,"-",1,null,"-"]
["Carrinho Tipo Passeio",null,1,"Sem regulagem",null,"0 meses","3 anos","Fixo",null,"Liberação em duas ações simultâneas",null,"Não possui acessórios",1,null,"Manual (com auxílio de ferramentas)"]
["Carrinho Tipo Conversível ou Múltiplo",null,2,"Com regulagem",null,"6 meses","4 anos","Removível",null,"Outro:",null,"Cesto porta-objetos",1,null,"Manual (sem auxílio de ferramentas)"]
["Carrinho combinado",null,3,"Outro:",null,"Outro:","Outro:",null,null,null,null,"Capa de proteção frontal",1,null,"Encaixe (com auxílio de ferramentas)"]
[null,null,"Outro:",null,null,null,null,null,null,null,null,"Alça lateral para transporte",1,null,"Encaixe (sem auxílio de ferramentas)"]
[null,null,null,null,null,null,null,null,null,null,null,"Bandeja frontal e porta-bebidas",1,null,"Outro:"]
[null,null,null,null,null,null,null,null,null,null,null,"Capa de chuva",1]
[null,null,null,null,null,null,null,null,null,null,null,"Bolsa dos pais",1]
[null,null,null,null,null,null,null,null,null,null,null,"Bomba para encher pneus",1]
[null,null,null,null,null,null,null,null,null,null,null,"Dispositivo adicionais de retenção",2]
[null,null,null,null,null,null,null,null,null,null,null,null,2]
[null,null,null,null,null,null,null,null,null,null,null,null,2]
[]
[null,null,null,null,null,null,null,null,null,null,null,null,1]
[null,null,null,null,null,null,null,null,null,null,null,null,1]
[null,null,null,null,null,null,null,null,null,null,null,null,1]
[null,null,null,null,null,null,null,null,null,null,null,null,1]
[null,null,null,null,null,null,null,null,null,null,null,null,1]
[null,null,null,null,null,null,null,null,null,null,null,null,1]
[null,null,null,null,null,null,null,null,null,null,null,null,1]
[null,null,null,null,null,null,null,null,null,null,null,null,1]
[null,null,null,null,null,null,null,null,null,null,null,null,1]
[null,null,null,null,null,null,null,null,null,null,null,null,2]
[null,null,null,null,null,null,null,null,null,null,null,null,2]
[null,null,null,null,null,null,null,null,null,null,null,null,2]